Git 2.26.2 and failed self tests on OS X
- From
- Jeffrey Walton <noloader@gmail.com>
- Date
- May 4, 2020, 07:03 UTC
- Message-ID
- <CAH8yC8myTMOetxgaj1wt0MbvSQ0LSRV0FHz4ywsBM1zzhUQG=w@mail.gmail.com>
Hi Everyone,
I'm building Git 2.26.2 from sources on a Mac-mini with OS X 10.12.6 and a PowerMac with OS X 10.5. Some of the t3902-quoted.sh tests are failing.
The Mac-Mini uses Bash 3.2.57(1)-release. The PowerMac uses 3.2.17(1)-release.
Jeff
*** t3902-quoted.sh *** not ok 1 - setup # # # mkdir "$FN" && # for_each_name "echo initial >\"\$name\"" && # git add . && # git commit -q -m Initial && # # for_each_name "echo second >\"\$name\"" && # git commit -a -m Second && # # for_each_name "echo modified >\"\$name\"" # # ok 2 - setup expected files not ok 3 - check fully quoted output from ls-files # # # git ls-files >current && test_cmp expect.quoted current # # not ok 4 - check fully quoted output from diff-files # # # git diff --name-only >current && # test_cmp expect.quoted current # # not ok 5 - check fully quoted output from diff-index # # # git diff --name-only HEAD >current && # test_cmp expect.quoted current # # not ok 6 - check fully quoted output from diff-tree # # # git diff --name-only HEAD^ HEAD >current && # test_cmp expect.quoted current # # not ok 7 - check fully quoted output from ls-tree # # # git ls-tree --name-only -r HEAD >current && # test_cmp expect.quoted current # # ok 8 - setting core.quotepath not ok 9 - check fully quoted output from ls-files # # # git ls-files >current && test_cmp expect.raw current # # not ok 10 - check fully quoted output from diff-files # # # git diff --name-only >current && # test_cmp expect.raw current # # not ok 11 - check fully quoted output from diff-index # # # git diff --name-only HEAD >current && # test_cmp expect.raw current # # not ok 12 - check fully quoted output from diff-tree # # # git diff --name-only HEAD^ HEAD >current && # test_cmp expect.raw current # # not ok 13 - check fully quoted output from ls-tree # # # git ls-tree --name-only -r HEAD >current && # test_cmp expect.raw current # # # failed 11 among 13 test(s) 1..13 make[2]: *** [t3902-quoted.sh] Error 1 make[1]: *** [test] Error 2 make: *** [test] Error 2