Re: GIT 0.99.9
- From
- Wolfgang Denk <wd@denx.de>
- Date
- Oct 30, 2005, 17:20 UTC
- Message-ID
- <20051030172018.520BD353416@atlas.denx.de>
- In-Reply-To
- <7vd5lnztav.fsf@assigned-by-dhcp.cox.net>
In message <7vd5lnztav.fsf@assigned-by-dhcp.cox.net> you wrote:
> GIT 0.99.9 is found at usual places.
"make rpm" does not work for me:
... make -C templates install make[2]: Entering directory `/usr/local/BUILD/git-core-0.99.9/templates' : no custom templates yet find blt blt blt/branches blt/hooks blt/hooks/post-commit blt/hooks/applypatch-msg blt/hooks/commit-msg blt/hooks/post-update blt/hooks/update blt/hooks/pre-applypatch blt/hooks/pre-commit blt/info blt/info/exclude blt/description blt/remotes install -d -m755 '/var/tmp/git-core-0.99.9-1-root-wd/usr/share/git-core/templates/' (cd blt && tar cf - .) | \ (cd '/var/tmp/git-core-0.99.9-1-root-wd/usr/share/git-core/templates/' && tar xf -) tar: This does not look like a tar archive tar: Skipping to next header tar: Error exit delayed from previous errors make[2]: *** [install] Error 2 make[2]: Leaving directory `/usr/local/BUILD/git-core-0.99.9/templates' make[1]: *** [install] Error 2 make[1]: Leaving directory `/usr/local/BUILD/git-core-0.99.9' error: Bad exit status from /var/tmp/rpm-tmp.96513 (%install)
RPM build errors:
Bad exit status from /var/tmp/rpm-tmp.96513 (%install)
make: *** [rpm] Error 1Best regards,
Wolfgang Denk
-- Software Engineering: Embedded and Realtime Systems, Embedded Linux Phone: (+49)-8142-66989-10 Fax: (+49)-8142-66989-80 Email: wd@denx.de "The computer programmer is a creator of universes for which he alone is responsible. Universes of virtually unlimited complexity can be created in the form of computer programs." - Joseph Weizenbaum, _Computer Power and Human Reason_