threads / discuss / 53338

t0000 failed

Subject: t0000 failed

## tl;dr

3 messages between Apr 28, 2020 and May 1, 2020.

replies: 2people: 3as markdown or json

Son Luong Ngoc· Apr 28, 2020, 06:52 UTC · lore
Hey folks,
Running t0000 with GIT_TEST_FAIL_PREREQS=true is failing.
> GIT_TEST_FAIL_PREREQS=true ./t0000-basic.sh
t/./t0000-basic.sh:836: error: not ok 45 - lazy prereqs do not turn off tracing
#
#               run_sub_test_lib_test lazy-prereq-and-tracing
 'lazy prereqs and -x' -v -x <<-\EOF &&
#               test_lazy_prereq LAZY true
#
#               test_expect_success lazy 'test_have_prereq LAZY && echo trace'
#
#               test_done
#               EOF
#
#               grep 'echo trace' lazy-prereq-and-tracing/err
#

This was added recently with https://public-inbox.org/git/f35830c0eba216b7b4f144409e302a87ff8b5c06.1585236929.git.gitgitgadget@gmail.com/ Is this intended?

Cheers, Son Luong.

Jeff King· Apr 28, 2020, 08:14 UTC · re: Son Luong Ngoc · lore

[PATCH] t0000: disable GIT_TEST_FAIL_PREREQS in sub-tests

On Tue, Apr 28, 2020 at 08:52:34AM +0200, Son Luong Ngoc wrote:
Show 15 quoted lines
> Running t0000 with GIT_TEST_FAIL_PREREQS=true is failing.
> 
> > GIT_TEST_FAIL_PREREQS=true ./t0000-basic.sh
> t/./t0000-basic.sh:836: error: not ok 45 - lazy prereqs do not turn off tracing
> #
> #               run_sub_test_lib_test lazy-prereq-and-tracing
>  'lazy prereqs and -x' -v -x <<-\EOF &&
> #               test_lazy_prereq LAZY true
> #
> #               test_expect_success lazy 'test_have_prereq LAZY && echo trace'
> #
> #               test_done
> #               EOF
> #
> #               grep 'echo trace' lazy-prereq-and-tracing/err
I think the patch below is the right fix.
-- >8 --
Subject: [PATCH] t0000: disable GIT_TEST_FAIL_PREREQS in sub-tests

The test added by 477dcaddb6 (tests: do not let lazy prereqs inside `test_expect_*` turn off tracing, 2020-03-26) runs a sub-test script that traces a test with a lazy prereq, like:

  test_have_prereq LAZY && echo trace

That won't work if GIT_TEST_FAIL_PREREQS is set in the environment, because our have_prereq will report failure, and we won't run the echo at all.

We could work around this by avoiding the &&-chain, but we can fix this and any future tests at once by unsetting that variable for our sub-tests. These are meant to be controlled environments where we test the test-suite itself; the outer test snippet should be in charge of the sub-test environment, not whatever mode the user happens to be running in.

Reported-by: Son Luong Ngoc <sluongng@gmail.com>
Signed-off-by: Jeff King <peff@peff.net>
---
 t/t0000-basic.sh | 1 +
 1 file changed, 1 insertion(+)
diff --git a/t/t0000-basic.sh b/t/t0000-basic.sh
index b859721620..f58f3deaa8 100755
--- a/t/t0000-basic.sh
+++ b/t/t0000-basic.sh
@@ -98,6 +98,7 @@ _run_sub_test_lib_test_common () {
 		export TEST_DIRECTORY &&
 		TEST_OUTPUT_DIRECTORY=$(pwd) &&
 		export TEST_OUTPUT_DIRECTORY &&
+		sane_unset GIT_TEST_FAIL_PREREQS &&
 		if test -z "$neg"
 		then
 			./"$name.sh" "$@" >out 2>err
-- 
2.26.2.827.g3c1233342b
Johannes Schindelin· May 1, 2020, 20:56 UTC · re: Jeff King · lore

Re: [PATCH] t0000: disable GIT_TEST_FAIL_PREREQS in sub-tests

Hi,
On Tue, 28 Apr 2020, Jeff King wrote:
Show 39 quoted lines
> On Tue, Apr 28, 2020 at 08:52:34AM +0200, Son Luong Ngoc wrote:
>
> > Running t0000 with GIT_TEST_FAIL_PREREQS=true is failing.
> >
> > > GIT_TEST_FAIL_PREREQS=true ./t0000-basic.sh
> > t/./t0000-basic.sh:836: error: not ok 45 - lazy prereqs do not turn off tracing
> > #
> > #               run_sub_test_lib_test lazy-prereq-and-tracing
> >  'lazy prereqs and -x' -v -x <<-\EOF &&
> > #               test_lazy_prereq LAZY true
> > #
> > #               test_expect_success lazy 'test_have_prereq LAZY && echo trace'
> > #
> > #               test_done
> > #               EOF
> > #
> > #               grep 'echo trace' lazy-prereq-and-tracing/err
>
> I think the patch below is the right fix.
>
> -- >8 --
> Subject: [PATCH] t0000: disable GIT_TEST_FAIL_PREREQS in sub-tests
>
> The test added by 477dcaddb6 (tests: do not let lazy prereqs inside
> `test_expect_*` turn off tracing, 2020-03-26) runs a sub-test script
> that traces a test with a lazy prereq, like:
>
>   test_have_prereq LAZY && echo trace
>
> That won't work if GIT_TEST_FAIL_PREREQS is set in the environment,
> because our have_prereq will report failure, and we won't run the echo
> at all.
>
> We could work around this by avoiding the &&-chain, but we can
> fix this and any future tests at once by unsetting that variable for our
> sub-tests. These are meant to be controlled environments where we test
> the test-suite itself; the outer test snippet should be in charge of the
> sub-test environment, not whatever mode the user happens to be running
> in.
Thanks for fixing a bug I introduced! The fix looks good to me.

Thank you, Dscho

Show 23 quoted lines
>
> Reported-by: Son Luong Ngoc <sluongng@gmail.com>
> Signed-off-by: Jeff King <peff@peff.net>
> ---
>  t/t0000-basic.sh | 1 +
>  1 file changed, 1 insertion(+)
>
> diff --git a/t/t0000-basic.sh b/t/t0000-basic.sh
> index b859721620..f58f3deaa8 100755
> --- a/t/t0000-basic.sh
> +++ b/t/t0000-basic.sh
> @@ -98,6 +98,7 @@ _run_sub_test_lib_test_common () {
>  		export TEST_DIRECTORY &&
>  		TEST_OUTPUT_DIRECTORY=$(pwd) &&
>  		export TEST_OUTPUT_DIRECTORY &&
> +		sane_unset GIT_TEST_FAIL_PREREQS &&
>  		if test -z "$neg"
>  		then
>  			./"$name.sh" "$@" >out 2>err
> --
> 2.26.2.827.g3c1233342b
>
>

← back to recent threads