# Help

2 messages from 2017-09-28 to 2017-09-28. Participants: Nityananda, Christian Couder.
Thread: https://gitlist.dev/t/46850

## Nityananda, 2017-09-28 01:21

Subject: Help
Message-ID: <1506561693.24644.2.camel@gmail.com>
URL: https://gitlist.dev/e/1506561693.24644.2.camel%40gmail.com

```
Hello,
I am new to this community. I am facing a problem while using the
"make" command inside the "t/" folder.

The error is 


"1..31
Makefile:49: recipe for target 't5551-http-fetch-smart.sh' failed
make[1]: *** [t5551-http-fetch-smart.sh] Error 1
make[1]: Leaving directory '/home/nitya/projects/git/t'
Makefile:36: recipe for target 'test' failed
make: *** [test] Error 2"

It will really be an act of kindness if you help me out.

Regards,
Nityananda Gohain

```

## Christian Couder, 2017-09-28 03:06

Subject: Re: Help
Message-ID: <CAP8UFD1XXg3m_xY9RC6HBoULxiL+jK-su_LbTLN=142uEznwVA@mail.gmail.com>
URL: https://gitlist.dev/e/CAP8UFD1XXg3m_xY9RC6HBoULxiL%2BjK-su_LbTLN%3D142uEznwVA%40mail.gmail.com
In-Reply-To: <1506561693.24644.2.camel@gmail.com>

```
Hi,

On Thu, Sep 28, 2017 at 3:21 AM, Nityananda <nityanandagohain@gmail.com> wrote:
> Hello,
> I am new to this community. I am facing a problem while using the
> "make" command inside the "t/" folder.
>
> The error is
>
>
> "1..31
> Makefile:49: recipe for target 't5551-http-fetch-smart.sh' failed
> make[1]: *** [t5551-http-fetch-smart.sh] Error 1
> make[1]: Leaving directory '/home/nitya/projects/git/t'
> Makefile:36: recipe for target 'test' failed
> make: *** [test] Error 2"

Could you try running "./t5551-http-fetch-smart.sh -v -i" to get more
information about the failing test?

```
