threads / discuss / 39681

Sporadic test failures on OSX 10.10.3

Subject: Sporadic test failures on OSX 10.10.3

## tl;dr

2 messages between Jun 20, 2015 and Jun 22, 2015.

replies: 1people: 2as markdown or json

Heiko Voigt· Jun 20, 2015, 09:47 UTC · lore
Hi,
I am currently experiencing sporadic test failures on Mac OS X 10.10.3:
Test Summary Report
-------------------
t7503-pre-commit-hook.sh                         (Wstat: 256 Tests: 11 Failed: 1)
  Failed test:  9
  Non-zero exit status: 1
t7502-commit.sh                                  (Wstat: 256 Tests: 64 Failed: 1)
  Failed test:  59
  Non-zero exit status: 1
t7407-submodule-foreach.sh                       (Wstat: 256 Tests: 17 Failed: 1)
  Failed test:  14
  Non-zero exit status: 1
t7406-submodule-update.sh                        (Wstat: 256 Tests: 43 Failed: 2)
  Failed tests:  36-37
  Non-zero exit status: 1
Files=702, Tests=12559, 618 wallclock secs ( 6.56 usr  2.08 sys + 716.50 cusr 932.03 csys = 1657.17 CPU)
Result: FAIL
make[1]: *** [prove] Error 1
make: *** [test] Error 2

When I execute the tests individually they succeed. Sometimes running the testsuite succeeds sometimes it does not. For example now running the testsuite the first and second time showed no failures. Only the third run revealed the above.

Is anyone else experiencing this as well? I am seeing this on Junios master (f86f31ab33c3). The list of failed tests varies sometimes.

Cheers Heiko
Eric Sunshine· Jun 22, 2015, 06:55 UTC · re: Heiko Voigt · lore

Re: Sporadic test failures on OSX 10.10.3

On Sat, Jun 20, 2015 at 5:47 AM, Heiko Voigt <hvoigt@hvoigt.net> wrote:
Show 28 quoted lines
> I am currently experiencing sporadic test failures on Mac OS X 10.10.3:
>
> Test Summary Report
> -------------------
> t7503-pre-commit-hook.sh                         (Wstat: 256 Tests: 11 Failed: 1)
>   Failed test:  9
>   Non-zero exit status: 1
> t7502-commit.sh                                  (Wstat: 256 Tests: 64 Failed: 1)
>   Failed test:  59
>   Non-zero exit status: 1
> t7407-submodule-foreach.sh                       (Wstat: 256 Tests: 17 Failed: 1)
>   Failed test:  14
>   Non-zero exit status: 1
> t7406-submodule-update.sh                        (Wstat: 256 Tests: 43 Failed: 2)
>   Failed tests:  36-37
>   Non-zero exit status: 1
> Files=702, Tests=12559, 618 wallclock secs ( 6.56 usr  2.08 sys + 716.50 cusr 932.03 csys = 1657.17 CPU)
> Result: FAIL
> make[1]: *** [prove] Error 1
> make: *** [test] Error 2
>
> When I execute the tests individually they succeed. Sometimes running the
> testsuite succeeds sometimes it does not. For example now running the
> testsuite the first and second time showed no failures. Only the third run
> revealed the above.
>
> Is anyone else experiencing this as well? I am seeing this on Junios
> master (f86f31ab33c3). The list of failed tests varies sometimes.
Confirmed.

← back to recent threads