From: Boyd Lynn Gerber Date: Wed, 17 Sep 2008 01:02:41 GMT Subject: Re: [RFC/PATCH] Use compatibility regex library for OSX/Darwin Message-ID: In-Reply-To: <20080916234624.GA14405@coredump.intra.peff.net> On Tue, 16 Sep 2008, Jeff King wrote: > On Tue, Sep 16, 2008 at 05:42:11PM -0600, Boyd Lynn Gerber wrote: >> When I do a gmake test these 4 platforms all fail only these 2 tests. >> >> * FAIL 10: reinit >> [...] >> * FAIL 11: init with --template >> [...] >> gmake[1]: *** [t0001-init.sh] Error 1 >> >> I have not had time to look into the failures. How many tests should I >> see and pass. The first 40 all pass. Then 2 of 12 fail as above. > > These failures are unrelated to the described problem, and prevent the > system from continuing on to run other tests. > > So if you get a chance, please: > > gmake test GIT_TEST_OPTS=--verbose So with path set so my /usr/gnu/bin/ is before any others this is what I get as the next failure. After a long run... * FAIL 5: alternation in pattern git config diff.java.funcname "^[ ]*\(\(public\|static\).*\)$" git diff --no-index Beer.java Beer-correct.java | grep "^@@.*@@ public static void main(" * failed 1 among 5 test(s) gmake[1]: *** [t4018-diff-funcname.sh] Error 1 gmake[1]: Leaving directory `/home/zenez/build/osr6/git-1.6.0.2/t' gmake: *** [test] Error 2 -- Boyd Gerber ZENEZ 1042 East Fort Union #135, Midvale Utah 84047