From: Alex Kuleshov Date: Thu, 13 Nov 2014 10:59:12 GMT Subject: t9902-completion.sh failed Message-ID: <87mw7v9xhl.fsf@gmail.com> Hello all, i just got git from master (f6f61cbbad0611e03b712cc354f1665b5d7b087e), built and installed it successfully, now i'm running make test and got following error: *** t9902-completion.sh *** t9902-completion.sh: 118: /home/shk/dev/git/t/../contrib/completion/git-completion.bash: Syntax error: "(" unexpected (expecting "fi") FATAL: Unexpected exit with code 2 make[2]: *** [t9902-completion.sh] Error 1 make[2]: Leaving directory `/home/shk/dev/git/t' make[1]: *** [test] Error 2 make[1]: Leaving directory `/home/shk/dev/git/t' make: *** [test] Error 2 $ bash --version 4.3.11(1)-release (x86_64-pc-linux-gnu) -- Best regards. 0xAX